{"text_format":"1","workbook":"xlsx","n_sheets":3,"sheets":["Anrechnung erbrachter Leistung","Studiengänge","Begründung"],"not_rendered":{"charts":0,"images":2,"macros":1,"external_links":0,"defined_names":4,"comments":0,"pivot_tables":0},"unopened":[],"bounds":{"document_bytes":16777216,"sheet_cells":100000,"rows_first":2000,"rows_last":500,"rows_between":2000,"halvings":0,"cell_chars":16384,"cell_head_chars":4096},"cells_cut":0,"cells_raw":0,"read":"whole","date_system":"1900"}

{"sheet":"Anrechnung erbrachter Leistung","index":0,"n_rows":47,"n_cols":18,"rows_kept":47,"cut":false,"hidden":false,"merged":[[16,5,16,7],[5,1,6,6],[39,1,41,15],[46,1,49,15],[17,11,17,13],[16,11,16,15],[5,9,6,12],[7,9,8,12],[9,9,10,12],[5,13,6,15],[7,13,8,15],[9,13,10,15],[16,2,17,2],[1,4,4,7],[8,1,8,4],[1,9,2,12],[3,9,4,12],[1,13,2,15],[3,13,4,15]]}
[]
[null,null,null,null,"                             FH Münster\n                             Fachbereich Maschinenbau\n                             Prüfugsamt\n                             Stegerwaldst. 39\n                             48565 Steinfurt",null,null,null,null,"Name, Vorname:"]
[]
[null,null,null,null,null,null,null,null,null,"Martrikelnummer:"]
[]
[null,"Anrechnung von erbrachten Studienleistungen im Studiengang",null,null,null,null,null,null,null,"Straße:"]
[]
[null,null,null,null,null,null,null,null,null,"PLZ/Ort:"]
[]
[null,"Hiermit bitte ich um Anerkennung der nachfolgend aufgelisteten Leistungen.\t",null,null,null,null,null,null,null,"E-Mail:"]
[]
[]
[null,"Datum",null,"Unterschrift"]
[]
[null,"Vorlesung [V], Übung [Ü], Praktikum[P], Modulprüfung [MP], Hausarbeit [HA], Kombiprüfung [KP]"]
[]
[null,"Prüfungsnr.","Modul des \nBachelorstudiengangs\n(zu erbringende Leistung)","CP","Anerkennung wird beantragt durch erbrachte Leistung im Modul/Fach:","SWS",null,null,"CP","Art/\nPrfg","Note","Nicht vom Studierenden auszufüllen"]
[null,null,null,null,null,null,null,null,null,null,null,"Leistung kann anerkannt werden",null,null,"Bei\nbenoteten Leistungen","Unterschrift der/des zuständigen Lehrenden"]
[null,null,null,null,null,"V","Ü","P",null,null,null,"ja","nein","teilw.","Note",{"$f":"IFERROR(VLOOKUP(Q19,Studiengänge!$D$5:$F$32,2),\"\")","v":""},null,{"$f":"IFERROR(VLOOKUP(Q19,Studiengänge!$D$5:$F$32,3),\"\")","v":""}]
[null,{"$f":"IFERROR(VLOOKUP($C20,Studiengänge!$D$6:$F$85,2,0),\"\")","v":""},null,{"$f":"IFERROR(VLOOKUP($C20,Studiengänge!$D$6:$F$85,3,0),\"\")","v":""},null,null,null,null,null,null,null,null,null,null,null,{"$f":"IFERROR(VLOOKUP(Q20,Studiengänge!$D$5:$F$32,2),\"\")","v":""},null,{"$f":"IFERROR(VLOOKUP(Q20,Studiengänge!$D$5:$F$32,3),\"\")","v":""}]
{"$rows_left_out":28}
{"sheet":"Studiengänge","index":1,"n_rows":85,"n_cols":52,"rows_kept":85,"cut":false,"hidden":true,"merged":[[0,1,0,5],[2,17,2,19],[2,25,2,27],[2,21,2,23],[2,9,2,11],[2,13,2,15],[1,3,1,5],[2,37,2,39],[2,41,2,43],[2,45,2,47],[2,49,2,51],[2,29,2,31],[2,33,2,35]]}
[null,"Arbeitslisten"]
[null,null,null,"Auswahl Liste",null,null,null,null,null,"Maschinenbau"]
[null,"Studiengänge",null,null,null,null,null,null,null,"B.Sc. Maschinenbau - 84.113",null,null,null,"B.Sc. Maschinenbauinformatik - 84.213",null,null,null,"B.Sc. Wirtschaftsingenieurwesen Maschinenbau - 84.403",null,null,null,"B.Sc. Maschinenbau - Dual - 84.413",null,null,null,"B.Ed. Maschinebautechnik - Lehramt - B8-521",null,null,null,"B.Sc. International Engineering - Mechanical Engineering (Out) - 84.MEC.OUT",null,null,null,"B.Sc. International Engineering - Mechanical Engineering (Inc.) - 84.MEC",null,null,null,"M.Sc. Maschinenbau (Vollzeit) - 90.113",null,null,null,"M.Sc. Maschinenbau in Teilzeit - 90.314",null,null,null,"M.Ed. Maschinenbautechnik - Lehramt  - N1-521",null,null,null,"M.Ed. Maschinenbautechnik - Lehramt (berufsbegleitend) - N1-522"]
[null,null,"Nr.","Modul","Prüfungsnr.:","CP",null,null,"Nr.","Prüfungsnr.:","Modul","CP",null,"Prüfungsnr.:","Modul","CP",null,"Prüfungsnr.:","Modul","CP",null,"Prüfungsnr.:","Modul","CP",null,"Prüfungsnr.:","Modul","CP",null,"Prüfungsnr.:","Modul","CP",null,"Prüfungsnr.:","Modul","CP",null,"Prüfungsnr.:","Modul","CP",null,"Prüfungsnr.:","Modul","CP",null,"Prüfungsnr.:","Modul","CP",null,"Prüfungsnr.:","Modul","CP"]
[null,null,0,null,null,null,null,null,0]
[null,{"$f":"IF(ISBLANK(INDEX($J$3:$XFD$3,1+C6*4-4)),\"\",INDEX($J$3:$XFD$3,1+C6*4-4))","v":"B.Sc. Maschinenbau - 84.113"},1,{"$f":"IFERROR(IF(INDEX($J$6:$XFD$85,C6,MATCH('Anrechnung erbrachter Leistung'!$B$9,$J$3:$XFD$3,)+1)=0,\"\",IFERROR(INDEX($J$6:$XFD$85,C6,MATCH('Anrechnung erbrachter Leistung'!$B$9,$J$3:$XFD$3,)+1),\"\")),\"\")","v":""},{"$f":"IFERROR(IF(INDEX($J$6:$XFD$85,C6,MATCH('Anrechnung erbrachter Leistung'!$B$9,$J$3:$XFD$3,)+0)=0,\"\",IFERROR(INDEX($J$6:$XFD$85,C6,MATCH('Anrechnung erbrachter Leistung'!$B$9,$J$3:$XFD$3,)+0),\"\")),\"\")","v":""},{"$f":"IFERROR(IF(ISBLANK(INDEX($J$6:$XFD$85,C6,MATCH('Anrechnung erbrachter Leistung'!$B$9,$J$3:$XFD$3,)+2)),\"\",IFERROR(INDEX($J$6:$XFD$85,C6,MATCH('Anrechnung erbrachter Leistung'!$B$9,$J$3:$XFD$3,)+2),\"\")),\"\")","v":""},null,null,1,"MB.1.0111.0.M","Angewandte Informatik",5,null,"ETI.1.0009.0.M","Algorithmen und Datenstrukturen",8,null,"ITB.1.0029.0.M","Allgemeine Betriebswirtschaftslehre",6,null,"MB.1.0111.0.M","Angewandte Informatik",5,null,"MB.1.0019.0.M","CIM",6,null,"MB.1.0025.0.M","Dynamik",5,null,"MB.1.0219.0.M","Module an der Partnerhochschule UPB / USACH",120,null,"MB.2.0005.0.M","Advanced English",6,null,"MB.2.0005.0.M","Advanced English",6,null,"MB.2.0017.0.M","Fügetechnik",5,null,"MB.2.0019.0.M","Getriebetechnik",5]
[null,"B.Sc. Maschinenbauinformatik - 84.213",2,{"$f":"IFERROR(IF(INDEX($J$6:$XFD$85,C7,MATCH('Anrechnung erbrachter Leistung'!$B$9,$J$3:$XFD$3,)+1)=0,\"\",IFERROR(INDEX($J$6:$XFD$85,C7,MATCH('Anrechnung erbrachter Leistung'!$B$9,$J$3:$XFD$3,)+1),\"\")),\"\")","v":""},{"$f":"IFERROR(IF(INDEX($J$6:$XFD$85,C7,MATCH('Anrechnung erbrachter Leistung'!$B$9,$J$3:$XFD$3,)+0)=0,\"\",IFERROR(INDEX($J$6:$XFD$85,C7,MATCH('Anrechnung erbrachter Leistung'!$B$9,$J$3:$XFD$3,)+0),\"\")),\"\")","v":""},{"$f":"IFERROR(IF(ISBLANK(INDEX($J$6:$XFD$85,C7,MATCH('Anrechnung erbrachter Leistung'!$B$9,$J$3:$XFD$3,)+2)),\"\",IFERROR(INDEX($J$6:$XFD$85,C7,MATCH('Anrechnung erbrachter Leistung'!$B$9,$J$3:$XFD$3,)+2),\"\")),\"\")","v":""},null,null,2,"MB.1.0012.0.M","Anlagentechniks Projekt",5,null,"MB.1.0011.0.M","Angewandte Informatik",5,null,"MB.1.0111.0.M","Angewandte Informatik",5,null,"MB.1.0122.0.M","Datenbanksysteme",5,null,"MB.1.0027.0.M","Elektrotechnik",6,null,"MB.1.0027.0.M","Elektrotechnik",5,null,null,null,null,null,"MB.2.0006.0.M","Agrarverfahrenstechnik",6,null,"MB.2.0006.0.M","Agrarverfahrenstechnik",6,null,"MB.2.0……..","Verbrennungskraftmaschinen",5,null,"MB.2.0030.0.M","Integrierte Produktentwicklung",5]
[null,"B.Sc. Wirtschaftsingenieurwesen Maschinenbau - 84.403",3,{"$f":"IFERROR(IF(INDEX($J$6:$XFD$85,C8,MATCH('Anrechnung erbrachter Leistung'!$B$9,$J$3:$XFD$3,)+1)=0,\"\",IFERROR(INDEX($J$6:$XFD$85,C8,MATCH('Anrechnung erbrachter Leistung'!$B$9,$J$3:$XFD$3,)+1),\"\")),\"\")","v":""},{"$f":"IFERROR(IF(INDEX($J$6:$XFD$85,C8,MATCH('Anrechnung erbrachter Leistung'!$B$9,$J$3:$XFD$3,)+0)=0,\"\",IFERROR(INDEX($J$6:$XFD$85,C8,MATCH('Anrechnung erbrachter Leistung'!$B$9,$J$3:$XFD$3,)+0),\"\")),\"\")","v":""},{"$f":"IFERROR(IF(ISBLANK(INDEX($J$6:$XFD$85,C8,MATCH('Anrechnung erbrachter Leistung'!$B$9,$J$3:$XFD$3,)+2)),\"\",IFERROR(INDEX($J$6:$XFD$85,C8,MATCH('Anrechnung erbrachter Leistung'!$B$9,$J$3:$XFD$3,)+2),\"\")),\"\")","v":""},null,null,3,"MB.1.0013.0.M","Apparate- und Anlagenbau",5,null,"MB.1.0195.0.M","Automotive Systems",5,null,"MB.1.0195.0.M","Automotive Systems",5,null,"MB.1.0196.0.M","Digitale Produktion",5,null,"MB.1.0036.0.M","Fertigungsverfahren 1",7,null,"MB.1.0036.0.M","Fertigungsverfahren 1",5,null,null,null,null,null,"MB.2.0007.0.M","Anlagenplanung",6,null,"MB.2.0007.0.M","Anlagenplanung",6,null,"MB.2.0057.0.M","Robotertechnik",5,null,"MB.2.0036.0.M","Konstruieren mit Kunststoffen",5]
[null,"B.Sc. Maschinenbau - Dual - 84.413",4,{"$f":"IFERROR(IF(INDEX($J$6:$XFD$85,C9,MATCH('Anrechnung erbrachter Leistung'!$B$9,$J$3:$XFD$3,)+1)=0,\"\",IFERROR(INDEX($J$6:$XFD$85,C9,MATCH('Anrechnung erbrachter Leistung'!$B$9,$J$3:$XFD$3,)+1),\"\")),\"\")","v":""},{"$f":"IFERROR(IF(INDEX($J$6:$XFD$85,C9,MATCH('Anrechnung erbrachter Leistung'!$B$9,$J$3:$XFD$3,)+0)=0,\"\",IFERROR(INDEX($J$6:$XFD$85,C9,MATCH('Anrechnung erbrachter Leistung'!$B$9,$J$3:$XFD$3,)+0),\"\")),\"\")","v":""},{"$f":"IFERROR(IF(ISBLANK(INDEX($J$6:$XFD$85,C9,MATCH('Anrechnung erbrachter Leistung'!$B$9,$J$3:$XFD$3,)+2)),\"\",IFERROR(INDEX($J$6:$XFD$85,C9,MATCH('Anrechnung erbrachter Leistung'!$B$9,$J$3:$XFD$3,)+2),\"\")),\"\")","v":""},null,null,4,"MB.1.0195.0.M","Automotive Systems",5,null,"ETI.1.0056.0.M","Computergrafik",5,null,"MB.1.0019.0.M","CIM",5,null,"MB.1.0145.0.M","Digitalisierung im Maschinenbau",5,null,"MB.1.0039.0.M","Fertigungsverfahren 2",6,null,"MB.1.0040.0.M","Festigkeitslehre",5,null,null,null,null,null,"MB.2.0008.0.M","Antriebssysteme ",6,null,"MB.2.0008.0.M","Antriebssysteme ",6]
[null,"B.Ed. Maschinebautechnik - Lehramt - B8-521",5,{"$f":"IFERROR(IF(INDEX($J$6:$XFD$85,C10,MATCH('Anrechnung erbrachter Leistung'!$B$9,$J$3:$XFD$3,)+1)=0,\"\",IFERROR(INDEX($J$6:$XFD$85,C10,MATCH('Anrechnung erbrachter Leistung'!$B$9,$J$3:$XFD$3,)+1),\"\")),\"\")","v":""},{"$f":"IFERROR(IF(INDEX($J$6:$XFD$85,C10,MATCH('Anrechnung erbrachter Leistung'!$B$9,$J$3:$XFD$3,)+0)=0,\"\",IFERROR(INDEX($J$6:$XFD$85,C10,MATCH('Anrechnung erbrachter Leistung'!$B$9,$J$3:$XFD$3,)+0),\"\")),\"\")","v":""},{"$f":"IFERROR(IF(ISBLANK(INDEX($J$6:$XFD$85,C10,MATCH('Anrechnung erbrachter Leistung'!$B$9,$J$3:$XFD$3,)+2)),\"\",IFERROR(INDEX($J$6:$XFD$85,C10,MATCH('Anrechnung erbrachter Leistung'!$B$9,$J$3:$XFD$3,)+2),\"\")),\"\")","v":""},null,null,5,"MB.1.0122.0.M","Datenbanksysteme",5,null,"MB.1.0022.0.M","Datenbanksysteme",7,null,"MB.1.0196.0.M","Digitale Produktion",5,null,"MB.1.0024.0.M","Digitaltechnik",5,null,"MB.1.0040.0.M","Festigkeitslehre",5,null,"ITB.1.0027.0.M","Grundlagen der Betriebswirtschaftslehre",5,null,null,null,null,null,"MB.2.0009.0.M","Anwendung Numerischer Software",6,null,"MB.2.0009.0.M","Anwendung Numerischer Software",6]
[null,"B.Sc. International Engineering - Mechanical Engineering (Out) - 84.MEC.OUT",6,{"$f":"IFERROR(IF(INDEX($J$6:$XFD$85,C11,MATCH('Anrechnung erbrachter Leistung'!$B$9,$J$3:$XFD$3,)+1)=0,\"\",IFERROR(INDEX($J$6:$XFD$85,C11,MATCH('Anrechnung erbrachter Leistung'!$B$9,$J$3:$XFD$3,)+1),\"\")),\"\")","v":""},{"$f":"IFERROR(IF(INDEX($J$6:$XFD$85,C11,MATCH('Anrechnung erbrachter Leistung'!$B$9,$J$3:$XFD$3,)+0)=0,\"\",IFERROR(INDEX($J$6:$XFD$85,C11,MATCH('Anrechnung erbrachter Leistung'!$B$9,$J$3:$XFD$3,)+0),\"\")),\"\")","v":""},{"$f":"IFERROR(IF(ISBLANK(INDEX($J$6:$XFD$85,C11,MATCH('Anrechnung erbrachter Leistung'!$B$9,$J$3:$XFD$3,)+2)),\"\",IFERROR(INDEX($J$6:$XFD$85,C11,MATCH('Anrechnung erbrachter Leistung'!$B$9,$J$3:$XFD$3,)+2),\"\")),\"\")","v":""},null,null,6,"MB.1.0196.0.M","Digitale Produktion",5,null,"MB.1.0196.0.M","Digitale Produktion",5,null,"MB.1.0027.0.M","Elektrotechnik",5,null,"MB.1.0025.0.M","Dynamik",5,null,"MB.1.0050.0.M","Grundlagen der Konstruktion",8,null,"MB.1.0050.0.M","Grundlagen der Konstruktion",9,null,null,null,null,null,"MB.2.0010.0.M","Betriebsfestigkeit",6,null,"MB.2.0010.0.M","Betriebsfestigkeit",6]
[null,"B.Sc. International Engineering - Mechanical Engineering (Inc.) - 84.MEC",7,{"$f":"IFERROR(IF(INDEX($J$6:$XFD$85,C12,MATCH('Anrechnung erbrachter Leistung'!$B$9,$J$3:$XFD$3,)+1)=0,\"\",IFERROR(INDEX($J$6:$XFD$85,C12,MATCH('Anrechnung erbrachter Leistung'!$B$9,$J$3:$XFD$3,)+1),\"\")),\"\")","v":""},{"$f":"IFERROR(IF(INDEX($J$6:$XFD$85,C12,MATCH('Anrechnung erbrachter Leistung'!$B$9,$J$3:$XFD$3,)+0)=0,\"\",IFERROR(INDEX($J$6:$XFD$85,C12,MATCH('Anrechnung erbrachter Leistung'!$B$9,$J$3:$XFD$3,)+0),\"\")),\"\")","v":""},{"$f":"IFERROR(IF(ISBLANK(INDEX($J$6:$XFD$85,C12,MATCH('Anrechnung erbrachter Leistung'!$B$9,$J$3:$XFD$3,)+2)),\"\",IFERROR(INDEX($J$6:$XFD$85,C12,MATCH('Anrechnung erbrachter Leistung'!$B$9,$J$3:$XFD$3,)+2),\"\")),\"\")","v":""},null,null,7,"MB.1.0145.0.M","Digitalisierung im Maschinenbau",5,null,"MB.1.0145.0.M","Digitalisierung im Maschinenbau",5,null,"MB.1.0203.0.M","Energie- u. Ressourceneffizienz",5,null,"MB.1.0027.0.M","Elektrotechnik",5,null,"MB.1.0052.0.M","Grundlagen der Programmierung",5,null,"MB.1.0052.0.M","Grundlagen der Programmierung",5,null,null,null,null,null,"MB.2.0012.0.M","Developments in Computer Science",6,null,"MB.2.0012.0.M","Developments in Computer Science",6]
[null,"M.Sc. Maschinenbau (Vollzeit) - 90.113",8,{"$f":"IFERROR(IF(INDEX($J$6:$XFD$85,C13,MATCH('Anrechnung erbrachter Leistung'!$B$9,$J$3:$XFD$3,)+1)=0,\"\",IFERROR(INDEX($J$6:$XFD$85,C13,MATCH('Anrechnung erbrachter Leistung'!$B$9,$J$3:$XFD$3,)+1),\"\")),\"\")","v":""},{"$f":"IFERROR(IF(INDEX($J$6:$XFD$85,C13,MATCH('Anrechnung erbrachter Leistung'!$B$9,$J$3:$XFD$3,)+0)=0,\"\",IFERROR(INDEX($J$6:$XFD$85,C13,MATCH('Anrechnung erbrachter Leistung'!$B$9,$J$3:$XFD$3,)+0),\"\")),\"\")","v":""},{"$f":"IFERROR(IF(ISBLANK(INDEX($J$6:$XFD$85,C13,MATCH('Anrechnung erbrachter Leistung'!$B$9,$J$3:$XFD$3,)+2)),\"\",IFERROR(INDEX($J$6:$XFD$85,C13,MATCH('Anrechnung erbrachter Leistung'!$B$9,$J$3:$XFD$3,)+2),\"\")),\"\")","v":""},null,null,8,"MB.1.0024.0.M","Digitaltechnik",5,null,"MB.1.0024.0.M","Digitaltechnik",5,null,"MB.1.0036.0.M","Fertigungsverfahren 1",5,null,"MB.1.0203.0.M","Energie- u. Ressourceneffizienz",5,null,"MB.1.0057.0.M","Hydraulik",6,null,"MB.1.0056.0.M","Grundzüge der FEM",5,null,null,null,null,null,"MB.2.0013.0.M","Fahrzeugtechnik",6,null,"MB.2.0013.0.M","Fahrzeugtechnik",6]
[null,"M.Sc. Maschinenbau in Teilzeit - 90.314",9,{"$f":"IFERROR(IF(INDEX($J$6:$XFD$85,C14,MATCH('Anrechnung erbrachter Leistung'!$B$9,$J$3:$XFD$3,)+1)=0,\"\",IFERROR(INDEX($J$6:$XFD$85,C14,MATCH('Anrechnung erbrachter Leistung'!$B$9,$J$3:$XFD$3,)+1),\"\")),\"\")","v":""},{"$f":"IFERROR(IF(INDEX($J$6:$XFD$85,C14,MATCH('Anrechnung erbrachter Leistung'!$B$9,$J$3:$XFD$3,)+0)=0,\"\",IFERROR(INDEX($J$6:$XFD$85,C14,MATCH('Anrechnung erbrachter Leistung'!$B$9,$J$3:$XFD$3,)+0),\"\")),\"\")","v":""},{"$f":"IFERROR(IF(ISBLANK(INDEX($J$6:$XFD$85,C14,MATCH('Anrechnung erbrachter Leistung'!$B$9,$J$3:$XFD$3,)+2)),\"\",IFERROR(INDEX($J$6:$XFD$85,C14,MATCH('Anrechnung erbrachter Leistung'!$B$9,$J$3:$XFD$3,)+2),\"\")),\"\")","v":""},null,null,9,"MB.1.0025.0.M","Dynamik",5,null,"MB.1.0027.0.M","Elektrotechnik",5,null,"MB.1.0039.0.M","Fertigungsverfahren 2",5,null,"MB.1.0036.0.M","Fertigungsverfahren 1",5,null,"MB.1.0059.0.M","Innovative Werkstoffe",6,null,"MB.1.0057.0.M","Hydraulik",5,null,null,null,null,null,"MB.2.0014.0.M","Fördertechnik",6,null,"MB.2.0014.0.M","Fördertechnik",6]
[null,"M.Ed. Maschinenbautechnik - Lehramt  - N1-521",10,{"$f":"IFERROR(IF(INDEX($J$6:$XFD$85,C15,MATCH('Anrechnung erbrachter Leistung'!$B$9,$J$3:$XFD$3,)+1)=0,\"\",IFERROR(INDEX($J$6:$XFD$85,C15,MATCH('Anrechnung erbrachter Leistung'!$B$9,$J$3:$XFD$3,)+1),\"\")),\"\")","v":""},{"$f":"IFERROR(IF(INDEX($J$6:$XFD$85,C15,MATCH('Anrechnung erbrachter Leistung'!$B$9,$J$3:$XFD$3,)+0)=0,\"\",IFERROR(INDEX($J$6:$XFD$85,C15,MATCH('Anrechnung erbrachter Leistung'!$B$9,$J$3:$XFD$3,)+0),\"\")),\"\")","v":""},{"$f":"IFERROR(IF(ISBLANK(INDEX($J$6:$XFD$85,C15,MATCH('Anrechnung erbrachter Leistung'!$B$9,$J$3:$XFD$3,)+2)),\"\",IFERROR(INDEX($J$6:$XFD$85,C15,MATCH('Anrechnung erbrachter Leistung'!$B$9,$J$3:$XFD$3,)+2),\"\")),\"\")","v":""},null,null,10,"MB.1.0027.0.M","Elektrotechnik",5,null,"MB.1.0036.0.M","Fertigungsverfahren 1",5,null,"MB.1.0040.0.M","Festigkeitslehre",5,null,"MB.1.0039.0.M","Fertigungsverfahren 2",5,null,"MB.1.0076.0.M","Konstruktion / CAD 1",5,null,"MB.1.0076.0.M","Konstruktion / CAD 1",5,null,null,null,null,null,"MB.2.0016.0.M","Fördertechnisches Seminar",6,null,"MB.2.0016.0.M","Fördertechnisches Seminar",6]
[null,"M.Ed. Maschinenbautechnik - Lehramt (berufsbegleitend) - N1-522",11,{"$f":"IFERROR(IF(INDEX($J$6:$XFD$85,C16,MATCH('Anrechnung erbrachter Leistung'!$B$9,$J$3:$XFD$3,)+1)=0,\"\",IFERROR(INDEX($J$6:$XFD$85,C16,MATCH('Anrechnung erbrachter Leistung'!$B$9,$J$3:$XFD$3,)+1),\"\")),\"\")","v":""},{"$f":"IFERROR(IF(INDEX($J$6:$XFD$85,C16,MATCH('Anrechnung erbrachter Leistung'!$B$9,$J$3:$XFD$3,)+0)=0,\"\",IFERROR(INDEX($J$6:$XFD$85,C16,MATCH('Anrechnung erbrachter Leistung'!$B$9,$J$3:$XFD$3,)+0),\"\")),\"\")","v":""},{"$f":"IFERROR(IF(ISBLANK(INDEX($J$6:$XFD$85,C16,MATCH('Anrechnung erbrachter Leistung'!$B$9,$J$3:$XFD$3,)+2)),\"\",IFERROR(INDEX($J$6:$XFD$85,C16,MATCH('Anrechnung erbrachter Leistung'!$B$9,$J$3:$XFD$3,)+2),\"\")),\"\")","v":""},null,null,11,"MB.1.0203.0.M","Energie- u. Ressourceneffizienz",5,null,"MB.1.0040.0.M","Festigkeitslehre",5,null,"ITB.1.0025.0.M","Finanzierung und Controlling",6,null,"MB.1.0040.0.M","Festigkeitslehre",5,null,"MB.1.0080.0.M","Maschinenelemente",5,null,"MB.1.0077.0.M","Konstruktion / CAD 2",5,null,null,null,null,null,"MB.2.0019.0.M","Getriebetechnik",6,null,"MB.2.0019.0.M","Getriebetechnik",6]
[null,"",12,{"$f":"IFERROR(IF(INDEX($J$6:$XFD$85,C17,MATCH('Anrechnung erbrachter Leistung'!$B$9,$J$3:$XFD$3,)+1)=0,\"\",IFERROR(INDEX($J$6:$XFD$85,C17,MATCH('Anrechnung erbrachter Leistung'!$B$9,$J$3:$XFD$3,)+1),\"\")),\"\")","v":""},{"$f":"IFERROR(IF(INDEX($J$6:$XFD$85,C17,MATCH('Anrechnung erbrachter Leistung'!$B$9,$J$3:$XFD$3,)+0)=0,\"\",IFERROR(INDEX($J$6:$XFD$85,C17,MATCH('Anrechnung erbrachter Leistung'!$B$9,$J$3:$XFD$3,)+0),\"\")),\"\")","v":""},{"$f":"IFERROR(IF(ISBLANK(INDEX($J$6:$XFD$85,C17,MATCH('Anrechnung erbrachter Leistung'!$B$9,$J$3:$XFD$3,)+2)),\"\",IFERROR(INDEX($J$6:$XFD$85,C17,MATCH('Anrechnung erbrachter Leistung'!$B$9,$J$3:$XFD$3,)+2),\"\")),\"\")","v":""},null,null,12,"MB.1.0206.0.M","Fahrzeugentwicklung u. -vernetzung",5,null,"ITB.1.0027.0.M","Grundlagen der Betriebswirtschaftslehre",5,null,"MB.1.0050.0.M","Grundlagen der Konstruktion",9,null,"MB.1.0042.0.M","Fügetechnik",5,null,"MB.1.0082.0.M","Mathematik 1",8,null,"MB.1.0080.0.M","Maschinenelemente",5,null,null,null,null,null,"MB.2.0022.0.M","Höhere FEM",6,null,"MB.2.0022.0.M","Höhere FEM",6]
[null,"",13,{"$f":"IFERROR(IF(INDEX($J$6:$XFD$85,C18,MATCH('Anrechnung erbrachter Leistung'!$B$9,$J$3:$XFD$3,)+1)=0,\"\",IFERROR(INDEX($J$6:$XFD$85,C18,MATCH('Anrechnung erbrachter Leistung'!$B$9,$J$3:$XFD$3,)+1),\"\")),\"\")","v":""},{"$f":"IFERROR(IF(INDEX($J$6:$XFD$85,C18,MATCH('Anrechnung erbrachter Leistung'!$B$9,$J$3:$XFD$3,)+0)=0,\"\",IFERROR(INDEX($J$6:$XFD$85,C18,MATCH('Anrechnung erbrachter Leistung'!$B$9,$J$3:$XFD$3,)+0),\"\")),\"\")","v":""},{"$f":"IFERROR(IF(ISBLANK(INDEX($J$6:$XFD$85,C18,MATCH('Anrechnung erbrachter Leistung'!$B$9,$J$3:$XFD$3,)+2)),\"\",IFERROR(INDEX($J$6:$XFD$85,C18,MATCH('Anrechnung erbrachter Leistung'!$B$9,$J$3:$XFD$3,)+2),\"\")),\"\")","v":""},null,null,13,"MB.1.0036.0.M","Fertigungsverfahren 1",5,null,"MB.1.0050.0.M","Grundlagen der Konstruktion",9,null,"MB.1.0051.0.M","Grundlagen der Landtechnik",5,null,"ITB.1.0027.0.M","Grundlagen der Betriebswirtschaftslehre",5,null,"MB.1.0083.0.M","Mathematik 2",6,null,"MB.1.0082.0.M","Mathematik 1",8,null,null,null,null,null,"MB.2.0024.0.M","Höhere Mathematik ",6,null,"MB.2.0024.0.M","Höhere Mathematik ",6]
[null,"",14,{"$f":"IFERROR(IF(INDEX($J$6:$XFD$85,C19,MATCH('Anrechnung erbrachter Leistung'!$B$9,$J$3:$XFD$3,)+1)=0,\"\",IFERROR(INDEX($J$6:$XFD$85,C19,MATCH('Anrechnung erbrachter Leistung'!$B$9,$J$3:$XFD$3,)+1),\"\")),\"\")","v":""},{"$f":"IFERROR(IF(INDEX($J$6:$XFD$85,C19,MATCH('Anrechnung erbrachter Leistung'!$B$9,$J$3:$XFD$3,)+0)=0,\"\",IFERROR(INDEX($J$6:$XFD$85,C19,MATCH('Anrechnung erbrachter Leistung'!$B$9,$J$3:$XFD$3,)+0),\"\")),\"\")","v":""},{"$f":"IFERROR(IF(ISBLANK(INDEX($J$6:$XFD$85,C19,MATCH('Anrechnung erbrachter Leistung'!$B$9,$J$3:$XFD$3,)+2)),\"\",IFERROR(INDEX($J$6:$XFD$85,C19,MATCH('Anrechnung erbrachter Leistung'!$B$9,$J$3:$XFD$3,)+2),\"\")),\"\")","v":""},null,null,14,"MB.1.0039.0.M","Fertigungsverfahren 2",5,null,"MB.1.0052.0.M","Grundlagen der Programmierung",5,null,"MB.1.0052.0.M","Grundlagen der Programmierung",5,null,"MB.1.0050.0.M","Grundlagen der Konstruktion",9,null,"MB.1.0094.0.M","Physik",6,null,"MB.1.0086.0.M","Mathematik 2 / Statistik",7,null,null,null,null,null,"MB.2.0025.0.M","Höhere Strömungsmaschinen",6,null,"MB.2.0025.0.M","Höhere Strömungsmaschinen",6]
[null,"",15,{"$f":"IFERROR(IF(INDEX($J$6:$XFD$85,C20,MATCH('Anrechnung erbrachter Leistung'!$B$9,$J$3:$XFD$3,)+1)=0,\"\",IFERROR(INDEX($J$6:$XFD$85,C20,MATCH('Anrechnung erbrachter Leistung'!$B$9,$J$3:$XFD$3,)+1),\"\")),\"\")","v":""},{"$f":"IFERROR(IF(INDEX($J$6:$XFD$85,C20,MATCH('Anrechnung erbrachter Leistung'!$B$9,$J$3:$XFD$3,)+0)=0,\"\",IFERROR(INDEX($J$6:$XFD$85,C20,MATCH('Anrechnung erbrachter Leistung'!$B$9,$J$3:$XFD$3,)+0),\"\")),\"\")","v":""},{"$f":"IFERROR(IF(ISBLANK(INDEX($J$6:$XFD$85,C20,MATCH('Anrechnung erbrachter Leistung'!$B$9,$J$3:$XFD$3,)+2)),\"\",IFERROR(INDEX($J$6:$XFD$85,C20,MATCH('Anrechnung erbrachter Leistung'!$B$9,$J$3:$XFD$3,)+2),\"\")),\"\")","v":""},null,null,15,"MB.1.0040.0.M","Festigkeitslehre",5,null,"MB.1.0056.0.M","Grundzüge der FEM",5,null,"EGU.1.0138.0.M","Grundlagen der Wasserstoffverwendung",5,null,"MB.1.0051.0.M","Grundlagen der Landtechnik",5,null,"MB.1.0113.0.M","Statik",5,null,"MB.1.0094.0.M","Physik",6,null,null,null,null,null,"MB.2.0027.0.M","Höhere Technische Mechanik",6,null,"MB.2.0027.0.M","Höhere Technische Mechanik",6]
{"$rows_left_out":66}
{"sheet":"Begründung","index":2,"n_rows":23,"n_cols":17,"rows_kept":23,"cut":false,"hidden":true,"merged":[[22,1,25,14],[2,1,2,14],[3,1,3,14],[4,1,6,1],[4,2,6,14],[7,1,9,1],[7,2,9,14],[19,1,21,1],[19,2,21,14],[10,1,12,1],[10,2,12,14],[13,1,15,1],[13,2,15,14],[16,1,18,1],[16,2,18,14]]}
[]
[null,"Nur vom Prüfungsamt auszufüllen!"]
[null,"Begründung/Bemerkung zu",null,null,null,null,null,null,null,null,null,null,null,null,null,null,{"$f":"IFERROR(VLOOKUP(P3,Studiengänge!$D$5:$F$32,3),\"\")","v":""}]
[null,"Prüfungsnr./ Modul",null,null,null,null,null,null,null,null,null,null,null,null,null,null,{"$f":"IFERROR(VLOOKUP(P4,Studiengänge!$D$5:$F$32,3),\"\")","v":""}]
[null,{"$f":"IFERROR(VLOOKUP(#REF!,Studiengänge!$D$6:$F$85,2,0),\"\")","v":""},{"$f":"IFERROR(VLOOKUP(#REF!,Studiengänge!$D$6:$F$85,3,0),\"\")","v":""},null,null,null,null,null,null,null,null,null,null,null,null,null,{"$f":"IFERROR(VLOOKUP(P5,Studiengänge!$D$5:$F$32,3),\"\")","v":""}]
[null,null,null,null,null,null,null,null,null,null,null,null,null,null,null,null,{"$f":"IFERROR(VLOOKUP(P6,Studiengänge!$D$5:$F$32,3),\"\")","v":""}]
[null,null,null,null,null,null,null,null,null,null,null,null,null,null,null,null,{"$f":"IFERROR(VLOOKUP(P7,Studiengänge!$D$5:$F$32,3),\"\")","v":""}]
[null,{"$f":"IFERROR(VLOOKUP(#REF!,Studiengänge!$D$6:$F$85,2,0),\"\")","v":""},{"$f":"IFERROR(VLOOKUP(#REF!,Studiengänge!$D$6:$F$85,3,0),\"\")","v":""},null,null,null,null,null,null,null,null,null,null,null,null,null,{"$f":"IFERROR(VLOOKUP(P8,Studiengänge!$D$5:$F$32,3),\"\")","v":""}]
[null,null,null,null,null,null,null,null,null,null,null,null,null,null,null,null,{"$f":"IFERROR(VLOOKUP(P9,Studiengänge!$D$5:$F$32,3),\"\")","v":""}]
[null,null,null,null,null,null,null,null,null,null,null,null,null,null,null,null,{"$f":"IFERROR(VLOOKUP(P10,Studiengänge!$D$5:$F$32,3),\"\")","v":""}]
[null,{"$f":"IFERROR(VLOOKUP(#REF!,Studiengänge!$D$6:$F$85,2,0),\"\")","v":""},{"$f":"IFERROR(VLOOKUP(#REF!,Studiengänge!$D$6:$F$85,3,0),\"\")","v":""}]
[]
[]
[null,{"$f":"IFERROR(VLOOKUP(#REF!,Studiengänge!$D$6:$F$85,2,0),\"\")","v":""},{"$f":"IFERROR(VLOOKUP(#REF!,Studiengänge!$D$6:$F$85,3,0),\"\")","v":""}]
[]
[]
[null,{"$f":"IFERROR(VLOOKUP(#REF!,Studiengänge!$D$6:$F$85,2,0),\"\")","v":""},{"$f":"IFERROR(VLOOKUP(#REF!,Studiengänge!$D$6:$F$85,3,0),\"\")","v":""}]
[]
[]
[null,{"$f":"IFERROR(VLOOKUP(#REF!,Studiengänge!$D$6:$F$85,2,0),\"\")","v":""},{"$f":"IFERROR(VLOOKUP(#REF!,Studiengänge!$D$6:$F$85,3,0),\"\")","v":""}]
{"$rows_left_out":3}